OpenSSH Server: Directive ‘SyslogFacility’ is not allowed within a Match block

I want a specific matched User to have its ‘ssh/scp’ activities logged in an alternative facility. The current default is AUTH, but I’d like to log stuff for user ‘dummy’ to syslog Facility ‘LOCAL2’. I’ve tried this in /etc/ssh/sshd_config, without success: Match User dummy SyslogFacility LOCAL2 I just get the following error message /etc/ssh/sshd_config line…

Details

Understanding the Internet better: How to create let’s encrypt certificate for domain that has no content yet supposed to run on nginx

My goal is to have a django app running on an EC2 instance using nginx inside of a docker container. I have the app. I have a domain. I have an EC2 instance. I’m trying to bring it all together. To configure my app with nginx I need ssl certificates. I want to use let’s…

Details

JEST map multiple folder structures with moduleNameMapper parameter

I have modules in node_modules folder and those dependancies are like below and use it like: import { NxDatepickerComponent } from ‘@xyz/ngx-ndbx/datefield/xyz-ngx-ndbx-datefield’; import { NX_DATE_FORMATS } from ‘@xyz/ngx-ndbx/datefield’; Folder structure is \[email protected]\ngx-ndbx\datefield For this I have moduleNameMapper as having followings for jest configuaration in package.json file: “moduleNameMapper”: { “@jkl(.*)”: “<rootDir>/src/app/modules/jkl/$1”, “@shared(.*)”: “<rootDir>/src/app/@shared/$1”, “^@xyz/(.*)$”: “<rootDir>/node_modules/@xyz*” },…

Details

Firefox does not display inputs on Azure website

hello i have a web app that works fine on chrome but on firefox it does not display my checkbox, inputs, text area etc… Even if I have a page that only have this: <!DOCTYPE html> <html lang=”en”> <head> <meta charset=”UTF-8″> <meta http-equiv=”MSTHEMECOMPATIBLE” content=”no”> <title>Checkbox Test</title> </head> <body> <input type=”checkbox”> <input type=”radio”> <input type=”text”> <input…

Details

An error has occurred in JavaDocs report generation

I have a problem with generate an javadoc documentation. After command: mvn javadoc:javadoc I have error: [INFO] ———————————————————————— [INFO] BUILD FAILURE [INFO] ———————————————————————— [INFO] Total time: 01:37 min [INFO] Finished at: 2020-01-15T13:50:02+01:00 [INFO] ———————————————————————— [ERROR] Failed to execute goal org.apache.maven.plugins:maven-javadoc-plugin:2.9.1:javadoc (default-cli) on project <project-name>: An error has occurred in JavaDocs report generation: [ERROR] Exit code:…

Details