Why does adding the “smallrye-reactive-messaging-camel” dependency result in these somewhat cryptic tomee server exceptions?

QUESTION: Why is the “smallrye-reactive-messaging-camel” dependency causing tomee server exceptions? I’m trying to piece together code for a simple java reactive streams app (using apache camel, smallrye). I’ve been referring to documentation at https://smallrye.io/smallrye-reactive-messaging/getting… specifically: “10. Integrating with Apache Camel”) below is only initial camel route code (i.e., no attempt at reactive programming) – i.e.…

ReactNative error “Execution failed for task”

I’m new to ReactNative either Expo or ReactNative Cli. I’m getting error while this command. exp build:android I checked log from expo. Standalone build failed! Execution failed for task ‘:app:mergeReleaseResources’. [stderr] > java.util.concurrent.ExecutionException: com.android.builder.internal.aapt.v2.Aapt2Exception: Android resource compilation failed [stderr] /app/turtle/workingdir/android/sdk34/android-shell-app/app/src/main/res/mipmap-mdpi/ic_launcher.png: error: failed to read PNG signature: file does not start with PNG signature. The checked…

Redhat 7.4 fresh VM add repository for slapd, ldap-utils package

I am trying to redo steps from: https://youtu.be/6ls6kRvGkrU?t=100 But there is Ubuntu, and i am wondering can i get the same packages on redhat 7.4? Currently they are missing: [k@localhost ~]$ sudo yum install slapd Loaded plugins: langpacks, product-id, search-disabled-repos, subscription-manager No package slapd available. Error: Nothing to do [k@localhost ~]$ sudo yum install ldap-utils…

This error keeps coming up how can I fix it please help

Traceback (most recent call last): File “C:\Program Files\Python36\lib\runpy.py”, line 193, in _run_module_as_main “main”, mod_spec) File “C:\Program Files\Python36\lib\runpy.py”, line 85, in run_code exec(code, run_globals) File “C:\Program Files\Python36\lib\site-packages\pygarl_main.py”, line 129, in cli() File “C:\Program Files\Python36\lib\site-packages\click\core.py”, line 764, in call return self.main(*args, **kwargs) File “C:\Program Files\Python36\lib\site-packages\click\core.py”, line 717, in main rv = self.invoke(ctx) File “C:\Program Files\Python36\lib\site-packages\click\core.py”, line 1137,…